Reaction Details
TargetOrexin receptor type 2
LigandBDBM50258741
Substrate/Competitorn/a
Meas. Tech.ChEMBL_633510 (CHEMBL1119824)
Ki 0.59±n/a nM
Citation Cox, CDBreslin, MJWhitman, DBSchreier, JDMcGaughey, GBBogusky, MJRoecker, AJMercer, SPBednar, RALemaire, WBruno, JGReiss, DRHarrell, CMMurphy, KLGarson, SLDoran, SMPrueksaritanont, TAnderson, WBTang, CRoller, SCabalu, TDCui, DHartman, GDYoung, SDKoblan, KSWinrow, CJRenger, JJColeman, PJ Discovery of the dual orexin receptor antagonist [(7R)-4-(5-chloro-1,3-benzoxazol-2-yl)-7-methyl-1,4-diazepan-1-yl][5-methyl-2-(2H-1,2,3-triazol-2-yl)phenyl]methanone (MK-4305) for the treatment of insomnia. J Med Chem53:5320-32 (2010) 
 
Orexin receptor type 2
Name:Orexin receptor type 2
Type:Protein
Mol. Mass.:50710.53
Organism:Homo sapiens (Human)
Description:O43614
Residue:444
BDBM50258741
NameBDBM50258741
Synonyms:(5-methyl-2-(2H-1,2,3-triazol-2-yl)phenyl)(4-(quinazolin-2-yl)-1,4-diazepan-1-yl)methanone | CHEMBL469146
TypeSmall organic molecule
Emp. Form.C23H23N7O
Mol. Mass.413.475
SMILESCc1ccc(c(c1)C(=O)N1CCCN(CC1)c1ncc2ccccc2n1)-n1nccn1