Reaction Details
TargetOrexin/Hypocretin receptor type 1
LigandBDBM50318699
Substrate/Competitorn/a
Meas. Tech.ChEMBL_633508 (CHEMBL1119822)
Ki 0.78±n/a nM
Citation Cox, CDBreslin, MJWhitman, DBSchreier, JDMcGaughey, GBBogusky, MJRoecker, AJMercer, SPBednar, RALemaire, WBruno, JGReiss, DRHarrell, CMMurphy, KLGarson, SLDoran, SMPrueksaritanont, TAnderson, WBTang, CRoller, SCabalu, TDCui, DHartman, GDYoung, SDKoblan, KSWinrow, CJRenger, JJColeman, PJ Discovery of the dual orexin receptor antagonist [(7R)-4-(5-chloro-1,3-benzoxazol-2-yl)-7-methyl-1,4-diazepan-1-yl][5-methyl-2-(2H-1,2,3-triazol-2-yl)phenyl]methanone (MK-4305) for the treatment of insomnia. J Med Chem53:5320-32 (2010) 
 
Orexin/Hypocretin receptor type 1
Name:Orexin/Hypocretin receptor type 1
Type:Protein
Mol. Mass.:47554.50
Organism:Homo sapiens (Human)
Description:O43613
Residue:425
BDBM50318699
NameBDBM50318699
Synonyms:2-{(5R)-5-Methyl-4-[2-(2H-1,2,3-triazol-2-yl)benzoyl]-1,4-diazepan-1-yl}5,6,7,8-tetrahydroquinazoline | CHEMBL1083657
TypeSmall organic molecule
Emp. Form.C23H27N7O
Mol. Mass.417.5068
SMILESC[C@@H]1CCN(CCN1C(=O)c1ccccc1-n1nccn1)c1ncc2CCCCc2n1