Reaction Details
TargetAcetylcholinesterase
LigandBDBM50317074
Substrate/Competitorn/a
Meas. Tech.ChEMBL_633735 (CHEMBL1119106)
Ki 24±n/a nM
Citation de Los Ríos, CEgea, JMarco-Contelles, JLeón, RSamadi, AIriepa, IMoraleda, IGálvez, EGarcía, AGLópez, MGVillarroya, MRomero, A Synthesis, inhibitory activity of cholinesterases, and neuroprotective profile of novel 1,8-naphthyridine derivatives. J Med Chem53:5129-43 (2010) 
 
Acetylcholinesterase
Name:Acetylcholinesterase
Type:Enzyme
Mol. Mass.:67792.70
Organism:Homo sapiens (Human)
Description:P22303
Residue:614
BDBM50317074
NameBDBM50317074
Synonyms:CHEMBL1087194 | ethyl 5-amino-2-methyl-6,7,8,9-tetrahydrobenzo[b][1,8]naphthyridine-3-carboxylate
TypeSmall organic molecule
Emp. Form.C16H19N3O2
Mol. Mass.285.341
SMILESCCOC(=O)c1cc2c(N)c3CCCCc3nc2nc1C