Reaction Details
TargetCruzipain
LigandBDBM18957
Substrate/Competitorn/a
Meas. Tech.ChEMBL_635150 (CHEMBL1119972)
IC50 206000±n/a nM
Citation Doak, AKWille, HPrusiner, SBShoichet, BK Colloid formation by drugs in simulated intestinal fluid. J Med Chem53:4259-65 (2010) 
 
Cruzipain
Name:Cruzipain
Type:Protein
Mol. Mass.:49831.41
Organism:Trypanosoma cruzi
Description:P25779
Residue:467
BDBM18957
NameBDBM18957
Synonyms:(2-{4-[(2-butyl-1-benzofuran-3-yl)carbonyl]-2,6-diiodophenoxy}ethyl)diethylamine Amiodarone Cordarone cid_441325
TypeSmall organic molecule
Emp. Form.C25H29I2NO3
Mol. Mass.645.3116
SMILESCCCCc1oc2ccccc2c1C(=O)c1cc(I)c(OCCN(CC)CC)c(I)c1