Reaction Details
TargetCruzipain
LigandBDBM50023198
Substrate/Competitorn/a
Meas. Tech.ChEMBL_635150 (CHEMBL1119972)
IC50 68000±n/a nM
Citation Doak, AKWille, HPrusiner, SBShoichet, BK Colloid formation by drugs in simulated intestinal fluid. J Med Chem53:4259-65 (2010) 
 
Cruzipain
Name:Cruzipain
Type:Protein
Mol. Mass.:49831.41
Organism:Trypanosoma cruzi
Description:P25779
Residue:467
BDBM50023198
NameBDBM50023198
Synonyms:8-[4-(4-phenylbutyloxy)benzoyl]amino-2-(tetrazol-5-yl)-4-oxo-4H-1-benzopyran N-(4-oxo-2-(1H-tetrazol-5-yl)-4H-chromen-8-yl)-4-(4-phenylbutoxy)benzamide N-[4-Oxo-2-(1H-tetrazol-5-yl)-4H-chromen-8-yl]-4-(4-phenyl-butoxy)-benzamide (ONO-RS-411) ONO-1078 | PRANLUKAST
TypeSmall organic molecule
Emp. Form.C27H23N5O4
Mol. Mass.481.5026
SMILESO=C(Nc1cccc2c1oc(cc2=O)-c1nnn[nH]1)c1ccc(OCCCCc2ccccc2)cc1