Reaction Details
TargetPotassium voltage-gated channel subfamily H member 2
LigandBDBM50319822
Substrate/Competitorn/a
Meas. Tech.ChEMBL_634882 (CHEMBL1120514)
IC50 40100±n/a nM
Citation Fray, MJFish, PVAllan, GABish, GClarke, NEccles, RHarrison, ACLe Net, JLPhillips, SCRegan, NSobry, CStobie, AWakenhut, FWestbrook, DWestbrook, SLWhitlock, GA Second generation N-(1,2-diphenylethyl)piperazines as dual serotonin and noradrenaline reuptake inhibitors: improving metabolic stability and reducing ion channel activity. Bioorg Med Chem Lett20:3788-92 (2010) 
 
Potassium voltage-gated channel subfamily H member 2
Name:Potassium voltage-gated channel subfamily H member 2
Type:Multi-pass membrane protein
Mol. Mass.:126672.65
Organism:Homo sapiens (Human)
Description:Q12809
Residue:1159
BDBM50319822
NameBDBM50319822
Synonyms:1-(1-(2-fluorophenyl)-2-(2-methoxyphenyl)ethyl)piperazine | CHEMBL1085959
TypeSmall organic molecule
Emp. Form.C19H23FN2O
Mol. Mass.314.3971
SMILESCOc1ccccc1CC(N1CCNCC1)c1ccccc1F