Reaction Details
TargetCytochrome P450 2D6
LigandBDBM50319822
Substrate/Competitorn/a
Meas. Tech.ChEMBL_634880 (CHEMBL1120512)
IC50 17700±n/a nM
Citation Fray, MJFish, PVAllan, GABish, GClarke, NEccles, RHarrison, ACLe Net, JLPhillips, SCRegan, NSobry, CStobie, AWakenhut, FWestbrook, DWestbrook, SLWhitlock, GA Second generation N-(1,2-diphenylethyl)piperazines as dual serotonin and noradrenaline reuptake inhibitors: improving metabolic stability and reducing ion channel activity. Bioorg Med Chem Lett20:3788-92 (2010) 
 
Cytochrome P450 2D6
Name:Cytochrome P450 2D6
Type:Protein
Mol. Mass.:55774.82
Organism:Homo sapiens (Human)
Description:P10635
Residue:497
BDBM50319822
NameBDBM50319822
Synonyms:1-(1-(2-fluorophenyl)-2-(2-methoxyphenyl)ethyl)piperazine | CHEMBL1085959
TypeSmall organic molecule
Emp. Form.C19H23FN2O
Mol. Mass.314.3971
SMILESCOc1ccccc1CC(N1CCNCC1)c1ccccc1F