Reaction Details
TargetSodium-dependent noradrenaline transporter
LigandBDBM50188098
Substrate/Competitorn/a
Meas. Tech.ChEMBL_634878 (CHEMBL1120510)
Ki 12±n/a nM
Citation Fray, MJFish, PVAllan, GABish, GClarke, NEccles, RHarrison, ACLe Net, JLPhillips, SCRegan, NSobry, CStobie, AWakenhut, FWestbrook, DWestbrook, SLWhitlock, GA Second generation N-(1,2-diphenylethyl)piperazines as dual serotonin and noradrenaline reuptake inhibitors: improving metabolic stability and reducing ion channel activity. Bioorg Med Chem Lett20:3788-92 (2010) 
 
Sodium-dependent noradrenaline transporter
Name:Sodium-dependent noradrenaline transporter
Type:Multi-pass membrane protein
Mol. Mass.:69337.72
Organism:Homo sapiens (Human)
Description:P23975
Residue:617
BDBM50188098
NameBDBM50188098
Synonyms:(R)-1-(2-(2-ethoxyphenyl)-1-phenylethyl)piperazine hydrochloride CHEMBL534723
TypeSmall organic molecule
Emp. Form.C20H26N2O
Mol. Mass.310.4332
SMILESCCOc1ccccc1C[C@@H](N1CCNCC1)c1ccccc1