Reaction Details
TargetSodium-dependent noradrenaline transporter
LigandBDBM50188048
Substrate/Competitorn/a
Meas. Tech.ChEMBL_634878 (CHEMBL1120510)
Ki 18±n/a nM
Citation Fray, MJFish, PVAllan, GABish, GClarke, NEccles, RHarrison, ACLe Net, JLPhillips, SCRegan, NSobry, CStobie, AWakenhut, FWestbrook, DWestbrook, SLWhitlock, GA Second generation N-(1,2-diphenylethyl)piperazines as dual serotonin and noradrenaline reuptake inhibitors: improving metabolic stability and reducing ion channel activity. Bioorg Med Chem Lett20:3788-92 (2010) 
 
Sodium-dependent noradrenaline transporter
Name:Sodium-dependent noradrenaline transporter
Type:Multi-pass membrane protein
Mol. Mass.:69337.72
Organism:Homo sapiens (Human)
Description:P23975
Residue:617
BDBM50188048
NameBDBM50188048
Synonyms:(+)-1-(2-(2-methoxyphenyl)-1-phenylethyl)piperazine 1-(2-(2-methoxyphenyl)-1-phenylethyl)piperazine | CHEMBL214335
TypeSmall organic molecule
Emp. Form.C19H24N2O
Mol. Mass.296.4067
SMILESCOc1ccccc1CC(N1CCNCC1)c1ccccc1