Reaction Details
TargetSodium-dependent noradrenaline transporter
LigandBDBM50188055
Substrate/Competitorn/a
Meas. Tech.ChEMBL_634878 (CHEMBL1120510)
Ki 31±n/a nM
Citation Fray, MJFish, PVAllan, GABish, GClarke, NEccles, RHarrison, ACLe Net, JLPhillips, SCRegan, NSobry, CStobie, AWakenhut, FWestbrook, DWestbrook, SLWhitlock, GA Second generation N-(1,2-diphenylethyl)piperazines as dual serotonin and noradrenaline reuptake inhibitors: improving metabolic stability and reducing ion channel activity. Bioorg Med Chem Lett20:3788-92 (2010) 
 
Sodium-dependent noradrenaline transporter
Name:Sodium-dependent noradrenaline transporter
Type:Multi-pass membrane protein
Mol. Mass.:69337.72
Organism:Homo sapiens (Human)
Description:P23975
Residue:617
BDBM50188055
NameBDBM50188055
Synonyms:1-(1-phenyl-2-(2-propoxyphenyl)ethyl)piperazine | CHEMBL213754
TypeSmall organic molecule
Emp. Form.C21H28N2O
Mol. Mass.324.4598
SMILESCCCOc1ccccc1CC(N1CCNCC1)c1ccccc1