Reaction Details
TargetSodium-dependent noradrenaline transporter
LigandBDBM50319826
Substrate/Competitorn/a
Meas. Tech.ChEMBL_634878 (CHEMBL1120510)
Ki 26±n/a nM
Citation Fray, MJFish, PVAllan, GABish, GClarke, NEccles, RHarrison, ACLe Net, JLPhillips, SCRegan, NSobry, CStobie, AWakenhut, FWestbrook, DWestbrook, SLWhitlock, GA Second generation N-(1,2-diphenylethyl)piperazines as dual serotonin and noradrenaline reuptake inhibitors: improving metabolic stability and reducing ion channel activity. Bioorg Med Chem Lett20:3788-92 (2010) 
 
Sodium-dependent noradrenaline transporter
Name:Sodium-dependent noradrenaline transporter
Type:Multi-pass membrane protein
Mol. Mass.:69337.72
Organism:Homo sapiens (Human)
Description:P23975
Residue:617
BDBM50319826
NameBDBM50319826
Synonyms:1-(2-(2-(difluoromethoxy)phenyl)-1-(3-fluorophenyl)ethyl)piperazine | CHEMBL1084577
TypeSmall organic molecule
Emp. Form.C19H21F3N2O
Mol. Mass.350.378
SMILESFC(F)Oc1ccccc1CC(N1CCNCC1)c1cccc(F)c1