Reaction Details
TargetSodium-dependent dopamine transporter
LigandBDBM50319823
Substrate/Competitorn/a
Meas. Tech.ChEMBL_634879 (CHEMBL1120511)
Ki 4060±n/a nM
Citation Fray, MJFish, PVAllan, GABish, GClarke, NEccles, RHarrison, ACLe Net, JLPhillips, SCRegan, NSobry, CStobie, AWakenhut, FWestbrook, DWestbrook, SLWhitlock, GA Second generation N-(1,2-diphenylethyl)piperazines as dual serotonin and noradrenaline reuptake inhibitors: improving metabolic stability and reducing ion channel activity. Bioorg Med Chem Lett20:3788-92 (2010) 
 
Sodium-dependent dopamine transporter
Name:Sodium-dependent dopamine transporter
Type:Multi-pass membrane protein
Mol. Mass.:68497.11
Organism:Homo sapiens (Human)
Description:Q01959
Residue:620
BDBM50319823
NameBDBM50319823
Synonyms:1-(1-(3-fluorophenyl)-2-(2-methoxyphenyl)ethyl)piperazine | CHEMBL1085321
TypeSmall organic molecule
Emp. Form.C19H23FN2O
Mol. Mass.314.3971
SMILESCOc1ccccc1CC(N1CCNCC1)c1cccc(F)c1