Reaction Details
TargetCarbonic anhydrase 1
LigandBDBM26995
Substrate/Competitorn/a
Meas. Tech.ChEMBL_635029 (CHEMBL1118580)
Ki 310000±n/a nM
Citation Di Fiore, AMonti, SMInnocenti, AWinum, JYDe Simone, GSupuran, CT Carbonic anhydrase inhibitors: crystallographic and solution binding studies for the interaction of a boron-containing aromatic sulfamide with mammalian isoforms I-XV. Bioorg Med Chem Lett20:3601-5 (2010) 
 
Carbonic anhydrase 1
Name:Carbonic anhydrase 1
Type:Enzyme
Mol. Mass.:28873.37
Organism:Homo sapiens (Human)
Description:P00915
Residue:261
BDBM26995
NameBDBM26995
Synonyms:CHEMBL355001 sulfamamide sulfamoylamine
Typen/a
Emp. Form.H4N2O2S
Mol. Mass.96.109
SMILESNS(N)(=O)=O