Reaction Details
TargetCarbonic anhydrase 5A, mitochondrial
LigandBDBM26995
Substrate/Competitorn/a
Meas. Tech.ChEMBL_635033 (CHEMBL1118584)
Ki 840000±n/a nM
Citation Di Fiore, AMonti, SMInnocenti, AWinum, JYDe Simone, GSupuran, CT Carbonic anhydrase inhibitors: crystallographic and solution binding studies for the interaction of a boron-containing aromatic sulfamide with mammalian isoforms I-XV. Bioorg Med Chem Lett20:3601-5 (2010) 
 
Carbonic anhydrase 5A, mitochondrial
Name:Carbonic anhydrase 5A, mitochondrial
Type:Enzyme
Mol. Mass.:34755.54
Organism:Homo sapiens (Human)
Description:Human (cloned) isozyme
Residue:305
BDBM26995
NameBDBM26995
Synonyms:CHEMBL355001 sulfamamide sulfamoylamine
Typen/a
Emp. Form.H4N2O2S
Mol. Mass.96.109
SMILESNS(N)(=O)=O