Reaction Details
TargetCarbonic anhydrase 12
LigandBDBM13055
Substrate/Competitorn/a
Meas. Tech.ChEMBL_635038 (CHEMBL1118589)
Ki 1875±n/a nM
Citation Di Fiore, AMonti, SMInnocenti, AWinum, JYDe Simone, GSupuran, CT Carbonic anhydrase inhibitors: crystallographic and solution binding studies for the interaction of a boron-containing aromatic sulfamide with mammalian isoforms I-XV. Bioorg Med Chem Lett20:3601-5 (2010) 
 
Carbonic anhydrase 12
Name:Carbonic anhydrase 12
Type:Enzyme
Mol. Mass.:39456.00
Organism:Homo sapiens (Human)
Description:Catalytic domain of human cloned isozyme was used in the assay
Residue:354
BDBM13055
NameBDBM13055
Synonyms:CHEMBL283695 Topiramate Sulfamide Analogue 8 | amino-N-{[(1R,2S,6S,9R)-4,4,11,11-tetramethyl-3,5,7,10,12-pentaoxatricyclo[7.3.0.0^{2,6}]dodecan-6-yl]methyl}sulfonamide
TypeSmall organic molecule
Emp. Form.C12H22N2O7S
Mol. Mass.338.377
SMILESCC1(C)O[C@@H]2CO[C@@]3(CNS(N)(=O)=O)OC(C)(C)O[C@H]3[C@@H]2O1