Reaction Details
TargetPolyunsaturated fatty acid lipoxygenase ALOX12
LigandBDBM50320452
Substrate/Competitorn/a
Meas. Tech.ChEMBL_636732 (CHEMBL1167021)
IC50>150000±n/a nM
Citation Robinson, SJHoobler, EKRiener, MLoveridge, STTenney, KValeriote, FAHolman, TRCrews, P Using enzyme assays to evaluate the structure and bioactivity of sponge-derived meroterpenes. J Nat Prod72:1857-63 (2009) 
 
Polyunsaturated fatty acid lipoxygenase ALOX12
Name:Polyunsaturated fatty acid lipoxygenase ALOX12
Type:Protein
Mol. Mass.:75689.18
Organism:Homo sapiens (Human)
Description:P18054
Residue:663
BDBM50320452
NameBDBM50320452
Synonyms:20-hydroxyhaterumadienone | CHEMBL1165577
TypeSmall organic molecule
Emp. Form.C20H28O3
Mol. Mass.316.4345
SMILESCC1(C)CCC[C@@]2(C)[C@H]1CC[C@]1(C)OC3CC(=O)C(=O)C3=C[C@H]21