Reaction Details
TargetPolyunsaturated fatty acid lipoxygenase ALOX15
LigandBDBM22372
Substrate/Competitorn/a
Meas. Tech.ChEMBL_636733 (CHEMBL1167022)
IC50 1100±n/a nM
Citation Robinson, SJHoobler, EKRiener, MLoveridge, STTenney, KValeriote, FAHolman, TRCrews, P Using enzyme assays to evaluate the structure and bioactivity of sponge-derived meroterpenes. J Nat Prod72:1857-63 (2009) 
 
Polyunsaturated fatty acid lipoxygenase ALOX15
Name:Polyunsaturated fatty acid lipoxygenase ALOX15
Type:Protein
Mol. Mass.:74804.05
Organism:Homo sapiens (Human)
Description:n/a
Residue:662
BDBM22372
NameBDBM22372
Synonyms:4-[(2R,3S)-4-(3,4-dihydroxyphenyl)-2,3-dimethylbutyl]benzene-1,2-diol CHEMBL313972 NDGA | Nordihydroguaiaretic Acid
TypeAntioxidant
Emp. Form.C18H22O4
Mol. Mass.302.3649
SMILESC[C@@H](Cc1ccc(O)c(O)c1)[C@H](C)Cc1ccc(O)c(O)c1