Reaction Details
TargetPolyunsaturated fatty acid 5-lipoxygenase
LigandBDBM50320448
Substrate/Competitorn/a
Meas. Tech.ChEMBL_636734 (CHEMBL1167023)
IC50 14000±n/a nM
Citation Robinson, SJHoobler, EKRiener, MLoveridge, STTenney, KValeriote, FAHolman, TRCrews, P Using enzyme assays to evaluate the structure and bioactivity of sponge-derived meroterpenes. J Nat Prod72:1857-63 (2009) 
 
Polyunsaturated fatty acid 5-lipoxygenase
Name:Polyunsaturated fatty acid 5-lipoxygenase
Type:Enzyme
Mol. Mass.:77972.74
Organism:Homo sapiens (Human)
Description:Recombinant protein was purified from E. coli lysate. After ammonium sulfate precipitation and subsequent steps, the supernatant (S100) was used for 5-LO activity assay.
Residue:674
BDBM50320448
NameBDBM50320448
Synonyms:CHEMBL1163939 | jaspic acid
TypeSmall organic molecule
Emp. Form.C27H38O3
Mol. Mass.410.5888
SMILES[#6]\[#6](-[#6])=[#6]/[#6]-[#6]C1([#6])[#6]-[#6]-[#6][C@@]2([#6])[#6@@H](-[#6]-c3cc(ccc3-[#8])-[#6](-[#8])=O)-[#6](-[#6])=[#6]-[#6]-[#6@H]12