Reaction Details
TargetPolyunsaturated fatty acid lipoxygenase ALOX12
LigandBDBM50240865
Substrate/Competitorn/a
Meas. Tech.ChEMBL_636732 (CHEMBL1167021)
IC50 22000±n/a nM
Citation Robinson, SJHoobler, EKRiener, MLoveridge, STTenney, KValeriote, FAHolman, TRCrews, P Using enzyme assays to evaluate the structure and bioactivity of sponge-derived meroterpenes. J Nat Prod72:1857-63 (2009) 
 
Polyunsaturated fatty acid lipoxygenase ALOX12
Name:Polyunsaturated fatty acid lipoxygenase ALOX12
Type:Protein
Mol. Mass.:75689.18
Organism:Homo sapiens (Human)
Description:P18054
Residue:663
BDBM50240865
NameBDBM50240865
Synonyms:(4aS,6aS,12aR,12bS)-10-Hydroxy-4,4,6a,12b-tetramethyl-1,2,3,4,4a,5,6,6a,12a,12b-decahydro-benzo[a]xanthen-9-one PUUPEHENONE
TypeSmall organic molecule
Emp. Form.C21H28O3
Mol. Mass.328.4452
SMILESCC1(C)CCC[C@@]2(C)[C@H]1CC[C@]1(C)OC3=CC(=O)C(=O)CC3=C[C@H]21