Reaction Details
TargetNeuraminidase
LigandBDBM50320773
Substrate/Competitorn/a
Meas. Tech.ChEMBL_639158 (CHEMBL1167419)
IC50>200000±n/a nM
Citation Wen, WHWang, SYTsai, KCCheng, YSYang, ASFang, JMWong, CH Analogs of zanamivir with modified C4-substituents as the inhibitors against the group-1 neuraminidases of influenza viruses. Bioorg Med Chem18:4074-84 (2010) 
 
Neuraminidase
Name:Neuraminidase
Type:PROTEIN
Mol. Mass.:49687.56
Organism:Influenza A virus
Description:ChEMBL_1347422
Residue:453
BDBM50320773
NameBDBM50320773
Synonyms:5-Acetamido-2,6-anhydro-4-[N-(3-aminopropyl)guanidino]-3,4,5-trideoxy-D-glycero-D-galacto-non-2-enonic acid | CHEMBL1164097
TypeSmall organic molecule
Emp. Form.C15H27N5O7
Mol. Mass.389.4042
SMILESCC(=O)N[C@H]1[C@@H](OC(=C[C@@H]1N(CCCN)C(N)=N)C(O)=O)[C@H](O)[C@H](O)CO