Reaction Details
TargetInterleukin-5
LigandBDBM50320923
Substrate/Competitorn/a
Meas. Tech.ChEMBL_638038 (CHEMBL1166941)
IC50 6100±n/a nM
Citation Thanigaimalai, PYang, HMSharma, VKKim, YJung, SH The scope of thallium nitrate oxidative cyclization of chalcones; synthesis and evaluation of isoflavone and aurone analogs for their inhibitory activity against interleukin-5. Bioorg Med Chem18:4441-5 (2010) 
 
Interleukin-5
Name:Interleukin-5
Type:PROTEIN
Mol. Mass.:15414.97
Organism:Mus musculus
Description:ChEMBL_1464308
Residue:133
BDBM50320923
NameBDBM50320923
Synonyms:5-(Cyclohexylmethoxy)-3-(3,4,5-trimethoxyphenyl)-4Hchromen-4-one | CHEMBL1163759
TypeSmall organic molecule
Emp. Form.C25H28O6
Mol. Mass.424.4862
SMILESCOc1ccc(c(OC)c1OC)-c1coc2cccc(OCC3CCCCC3)c2c1=O