Reaction Details
TargetHistone deacetylase 3
LigandBDBM19130
Substrate/Competitorn/a
Meas. Tech.ChEMBL_639058 (CHEMBL1166311)
IC50 0.6±n/a nM
Citation Estiu, GWest, NMazitschek, RGreenberg, EBradner, JEWiest, O On the inhibition of histone deacetylase 8. Bioorg Med Chem18:4103-10 (2010) 
 
Histone deacetylase 3
Name:Histone deacetylase 3
Type:Enzyme
Mol. Mass.:48829.55
Organism:Homo sapiens (Human)
Description:O15379
Residue:428
BDBM19130
NameBDBM19130
Synonyms:(2E,4E,6R)-7-[4-(dimethylamino)phenyl]-N-hydroxy-4,6-dimethyl-7-oxohepta-2,4-dienamide TSA | Trichostatin A (TSA)
TypeSmall organic molecule
Emp. Form.C17H22N2O3
Mol. Mass.302.3682
SMILESCC(C=CC(=O)NO)C=C(C)C(=O)c1ccc(cc1)N(C)C