Reaction Details
TargetHistone deacetylase 3
LigandBDBM22449
Substrate/Competitorn/a
Meas. Tech.ChEMBL_639058 (CHEMBL1166311)
IC50 630±n/a nM
Citation Estiu, GWest, NMazitschek, RGreenberg, EBradner, JEWiest, O On the inhibition of histone deacetylase 8. Bioorg Med Chem18:4103-10 (2010) 
 
Histone deacetylase 3
Name:Histone deacetylase 3
Type:Enzyme
Mol. Mass.:48829.55
Organism:Homo sapiens (Human)
Description:O15379
Residue:428
BDBM22449
NameBDBM22449
Synonyms:CHEMBL356769 Tubacin | US9249087, Tubastatin A
TypeSmall organic molecule
Emp. Form.C41H43N3O7S
Mol. Mass.721.861
SMILESOCc1ccc(cc1)[C@@H]1C[C@H](CSc2nc(c(o2)-c2ccccc2)-c2ccccc2)O[C@@H](O1)c1ccc(NC(=O)CCCCCCC(=O)NO)cc1