Reaction Details
TargetKappa-type opioid receptor
LigandBDBM50013388
Substrate/Competitorn/a
Meas. Tech.ChEMBL_639432 (CHEMBL1168405)
Ki 0.04±n/a nM
Citation Yamaotsu, NFujii, HNagase, HHirono, S Identification of the three-dimensional pharmacophore of kappa-opioid receptor agonists. Bioorg Med Chem18:4446-52 (2010) 
 
Kappa-type opioid receptor
Name:Kappa-type opioid receptor
Type:G Protein-Coupled Receptor (GPCR)
Mol. Mass.:42648.76
Organism:Homo sapiens (Human)
Description:P41145
Residue:380
BDBM50013388
NameBDBM50013388
Synonyms:6-Ethyl-3-(1-hydroxy-cyclopropylmethyl)-11,11-dimethyl-1,2,3,4,5,6-hexahydro-2,6-methano-benzo[d]azocin-8-ol Bremazocine | CHEMBL350384
TypeSmall organic molecule
Emp. Form.C20H29NO2
Mol. Mass.315.4498
SMILESCCC12CCN(CC3(O)CC3)C(Cc3ccc(O)cc13)C2(C)C