Reaction Details
TargetType-2 angiotensin II receptor
LigandBDBM50321083
Substrate/Competitorn/a
Meas. Tech.ChEMBL_637186 (CHEMBL1167160)
Ki 3.2±n/a nM
Citation Mahalingam, AKWan, YMurugaiah, AMWallinder, CWu, XPlouffe, BBotros, MNyberg, FHallberg, AGallo-Payet, NAlterman, M Selective angiotensin II AT(2) receptor agonists with reduced CYP 450 inhibition. Bioorg Med Chem18:4570-90 (2010) 
 
Type-2 angiotensin II receptor
Name:Type-2 angiotensin II receptor
Synonyms:Angiotensin type II receptor
Type:PROTEIN
Mol. Mass.:15474.49
Organism:Sus scrofa
Description:ChEMBL_1285617
Residue:137
BDBM50321083
NameBDBM50321083
TypeSmall organic molecule
Emp. Form.C23H28N2O4S3
Mol. Mass.492.674
SMILESCCCCOC(=O)NS(=O)(=O)c1sc(CC(C)C)cc1-c1ccc(Cc2nccs2)cc1