Reaction Details
TargetAndrogen receptor
LigandBDBM50321220
Substrate/Competitorn/a
Meas. Tech.ChEMBL_637915 (CHEMBL1169306)
Ki 24.2±n/a nM
Citation Du, YLi, QXiong, BHui, XWang, XFeng, YMeng, THu, DZhang, DWang, MShen, J Aromatic beta-amino-ketone derivatives as novel selective non-steroidal progesterone receptor antagonists. Bioorg Med Chem18:4255-68 (2010) 
 
Androgen receptor
Name:Androgen receptor
Type:Receptor
Mol. Mass.:99185.27
Organism:Homo sapiens (Human)
Description:CHO cells were stably transfected with human AR gene.
Residue:920
BDBM50321220
NameBDBM50321220
Synonyms:(-)-R-3-(4-Nitrophenylamino)-3-(3-fluorophenyl)-1-p-tolylpropan-1-one | CHEMBL1165497
TypeSmall organic molecule
Emp. Form.C22H19FN2O3
Mol. Mass.378.3963
SMILESCc1ccc(cc1)C(=O)C[C@@H](Nc1ccc(cc1)[N+]([O-])=O)c1cccc(F)c1