Reaction Details
TargetProgesterone receptor
LigandBDBM50321179
Substrate/Competitorn/a
Meas. Tech.ChEMBL_637916 (CHEMBL1169307)
Ki 31±n/a nM
Citation Du, YLi, QXiong, BHui, XWang, XFeng, YMeng, THu, DZhang, DWang, MShen, J Aromatic beta-amino-ketone derivatives as novel selective non-steroidal progesterone receptor antagonists. Bioorg Med Chem18:4255-68 (2010) 
 
Progesterone receptor
Name:Progesterone receptor
Type:Protein
Mol. Mass.:98979.52
Organism:Homo sapiens (Human)
Description:P06401
Residue:933
BDBM50321179
NameBDBM50321179
Synonyms:CHEMBL1163898 | rac-3-(4-Nitrophenylamino)-3-(4-(trifluoromethyl)phenyl)-1-(3-methoxyphenyl)propan-1-one
TypeSmall organic molecule
Emp. Form.C23H19F3N2O4
Mol. Mass.444.4032
SMILESCOc1cccc(c1)C(=O)CC(Nc1ccc(cc1)[N+]([O-])=O)c1ccc(cc1)C(F)(F)F