Reaction Details
TargetProgesterone receptor
LigandBDBM50321198
Substrate/Competitorn/a
Meas. Tech.ChEMBL_637916 (CHEMBL1169307)
Ki 8.5±n/a nM
Citation Du, YLi, QXiong, BHui, XWang, XFeng, YMeng, THu, DZhang, DWang, MShen, J Aromatic beta-amino-ketone derivatives as novel selective non-steroidal progesterone receptor antagonists. Bioorg Med Chem18:4255-68 (2010) 
 
Progesterone receptor
Name:Progesterone receptor
Type:Protein
Mol. Mass.:98979.52
Organism:Homo sapiens (Human)
Description:P06401
Residue:933
BDBM50321198
NameBDBM50321198
Synonyms:CHEMBL1163481 | rac-3-(4-Nitrophenylamino)-3-cyclohexyl-1-(4-fluorophenyl)-propan-1-one
TypeSmall organic molecule
Emp. Form.C21H23FN2O3
Mol. Mass.370.4173
SMILES[O-][N+](=O)c1ccc(NC(CC(=O)c2ccc(F)cc2)C2CCCCC2)cc1