Reaction Details
TargetProgesterone receptor
LigandBDBM50321211
Substrate/Competitorn/a
Meas. Tech.ChEMBL_637916 (CHEMBL1169307)
Ki 9.1±n/a nM
Citation Du, YLi, QXiong, BHui, XWang, XFeng, YMeng, THu, DZhang, DWang, MShen, J Aromatic beta-amino-ketone derivatives as novel selective non-steroidal progesterone receptor antagonists. Bioorg Med Chem18:4255-68 (2010) 
 
Progesterone receptor
Name:Progesterone receptor
Type:Protein
Mol. Mass.:98979.52
Organism:Homo sapiens (Human)
Description:P06401
Residue:933
BDBM50321211
NameBDBM50321211
Synonyms:CHEMBL1163529 | rac-3-(4-Nitrophenylamino)-1-(3,4-dichlorophenyl)-3-cyclohexylpropan-1-one
TypeSmall organic molecule
Emp. Form.C21H22Cl2N2O3
Mol. Mass.421.317
SMILES[O-][N+](=O)c1ccc(NC(CC(=O)c2ccc(Cl)c(Cl)c2)C2CCCCC2)cc1