Reaction Details
TargetAndrogen receptor
LigandBDBM50321203
Substrate/Competitorn/a
Meas. Tech.ChEMBL_637915 (CHEMBL1169306)
Ki 18±n/a nM
Citation Du, YLi, QXiong, BHui, XWang, XFeng, YMeng, THu, DZhang, DWang, MShen, J Aromatic beta-amino-ketone derivatives as novel selective non-steroidal progesterone receptor antagonists. Bioorg Med Chem18:4255-68 (2010) 
 
Androgen receptor
Name:Androgen receptor
Type:Receptor
Mol. Mass.:99185.27
Organism:Homo sapiens (Human)
Description:CHO cells were stably transfected with human AR gene.
Residue:920
BDBM50321203
NameBDBM50321203
Synonyms:CHEMBL1163604 | rac-3-(4-Nitrophenylamino)-3-phenyl-1-p-tolylpropan-1-one
TypeSmall organic molecule
Emp. Form.C22H20N2O3
Mol. Mass.360.4058
SMILESCc1ccc(cc1)C(=O)CC(Nc1ccc(cc1)[N+]([O-])=O)c1ccccc1