Reaction Details
TargetAndrogen receptor
LigandBDBM50321178
Substrate/Competitorn/a
Meas. Tech.ChEMBL_637915 (CHEMBL1169306)
Ki 30±n/a nM
Citation Du, YLi, QXiong, BHui, XWang, XFeng, YMeng, THu, DZhang, DWang, MShen, J Aromatic beta-amino-ketone derivatives as novel selective non-steroidal progesterone receptor antagonists. Bioorg Med Chem18:4255-68 (2010) 
 
Androgen receptor
Name:Androgen receptor
Type:Receptor
Mol. Mass.:99185.27
Organism:Homo sapiens (Human)
Description:CHO cells were stably transfected with human AR gene.
Residue:920
BDBM50321178
NameBDBM50321178
Synonyms:CHEMBL1163644 | rac-3-(4-Nitrophenylamino)-3-(3-fluorophenyl)-1-(4-fluorophenyl)propan-1-one
TypeSmall organic molecule
Emp. Form.C21H16F2N2O3
Mol. Mass.382.3601
SMILES[O-][N+](=O)c1ccc(NC(CC(=O)c2ccc(F)cc2)c2cccc(F)c2)cc1