Reaction Details
TargetAndrogen receptor
LigandBDBM50321196
Substrate/Competitorn/a
Meas. Tech.ChEMBL_637915 (CHEMBL1169306)
Ki 35±n/a nM
Citation Du, YLi, QXiong, BHui, XWang, XFeng, YMeng, THu, DZhang, DWang, MShen, J Aromatic beta-amino-ketone derivatives as novel selective non-steroidal progesterone receptor antagonists. Bioorg Med Chem18:4255-68 (2010) 
 
Androgen receptor
Name:Androgen receptor
Type:Receptor
Mol. Mass.:99185.27
Organism:Homo sapiens (Human)
Description:CHO cells were stably transfected with human AR gene.
Residue:920
BDBM50321196
NameBDBM50321196
Synonyms:CHEMBL1164752 | rac-3-(4-Nitrophenylamino)-1-(4-bromophenyl)-3-cyclohexylpropan-1-one
TypeSmall organic molecule
Emp. Form.C21H23BrN2O3
Mol. Mass.431.323
SMILES[O-][N+](=O)c1ccc(NC(CC(=O)c2ccc(Br)cc2)C2CCCCC2)cc1