Reaction Details
TargetProgesterone receptor
LigandBDBM50321177
Substrate/Competitorn/a
Meas. Tech.ChEMBL_637916 (CHEMBL1169307)
Ki 23±n/a nM
Citation Du, YLi, QXiong, BHui, XWang, XFeng, YMeng, THu, DZhang, DWang, MShen, J Aromatic beta-amino-ketone derivatives as novel selective non-steroidal progesterone receptor antagonists. Bioorg Med Chem18:4255-68 (2010) 
 
Progesterone receptor
Name:Progesterone receptor
Type:Protein
Mol. Mass.:98979.52
Organism:Homo sapiens (Human)
Description:P06401
Residue:933
BDBM50321177
NameBDBM50321177
Synonyms:CHEMBL1163597 | rac-3-(4-Nitrophenylamino)-1-(3-chlorophenyl)-3-(3-fluorophenyl)propan-1-one
TypeSmall organic molecule
Emp. Form.C21H16ClFN2O3
Mol. Mass.398.815
SMILES[O-][N+](=O)c1ccc(NC(CC(=O)c2cccc(Cl)c2)c2cccc(F)c2)cc1