Reaction Details
Target3-hydroxy-3-methylglutaryl-coenzyme A reductase
LigandBDBM50321267
Substrate/Competitorn/a
Meas. Tech.ChEMBL_638412 (CHEMBL1167858)
IC50 91300±n/a nM
Citation Argüelles, NSánchez-Sandoval, EMendieta, AVilla-Tanaca, LGarduño-Siciliano, LJiménez, FCruz, Mdel CMedina-Franco, JLChamorro-Cevallos, GTamariz, J Design, synthesis, and docking of highly hypolipidemic agents: Schizosaccharomyces pombe as a new model for evaluating alpha-asarone-based HMG-CoA reductase inhibitors. Bioorg Med Chem18:4238-48 (2010) 
 
3-hydroxy-3-methylglutaryl-coenzyme A reductase
Name:3-hydroxy-3-methylglutaryl-coenzyme A reductase
Type:PROTEIN
Mol. Mass.:114890.37
Organism:Schizosaccharomyces pombe
Description:ChEMBL_638412
Residue:1053
BDBM50321267
NameBDBM50321267
Synonyms:CHEMBL1163190 | methyl 2-(o-tolyloxy)acetate
TypeSmall organic molecule
Emp. Form.C10H12O3
Mol. Mass.180.2005
SMILESCOC(=O)COc1ccccc1C