Reaction Details
Target3-hydroxy-3-methylglutaryl-coenzyme A reductase
LigandBDBM50321269
Substrate/Competitorn/a
Meas. Tech.ChEMBL_638412 (CHEMBL1167858)
IC50 1315800±n/a nM
Citation Argüelles, NSánchez-Sandoval, EMendieta, AVilla-Tanaca, LGarduño-Siciliano, LJiménez, FCruz, Mdel CMedina-Franco, JLChamorro-Cevallos, GTamariz, J Design, synthesis, and docking of highly hypolipidemic agents: Schizosaccharomyces pombe as a new model for evaluating alpha-asarone-based HMG-CoA reductase inhibitors. Bioorg Med Chem18:4238-48 (2010) 
 
3-hydroxy-3-methylglutaryl-coenzyme A reductase
Name:3-hydroxy-3-methylglutaryl-coenzyme A reductase
Type:PROTEIN
Mol. Mass.:114890.37
Organism:Schizosaccharomyces pombe
Description:ChEMBL_638412
Residue:1053
BDBM50321269
NameBDBM50321269
Synonyms:CHEMBL1163835 | methyl 2-(4-ethylphenoxy)acetate
TypeSmall organic molecule
Emp. Form.C11H14O3
Mol. Mass.194.2271
SMILESCCc1ccc(OCC(=O)OC)cc1