Reaction Details
Target3-hydroxy-3-methylglutaryl-coenzyme A reductase
LigandBDBM50240783
Substrate/Competitorn/a
Meas. Tech.ChEMBL_638412 (CHEMBL1167858)
IC50 2488000±n/a nM
Citation Argüelles, NSánchez-Sandoval, EMendieta, AVilla-Tanaca, LGarduño-Siciliano, LJiménez, FCruz, Mdel CMedina-Franco, JLChamorro-Cevallos, GTamariz, J Design, synthesis, and docking of highly hypolipidemic agents: Schizosaccharomyces pombe as a new model for evaluating alpha-asarone-based HMG-CoA reductase inhibitors. Bioorg Med Chem18:4238-48 (2010) 
 
3-hydroxy-3-methylglutaryl-coenzyme A reductase
Name:3-hydroxy-3-methylglutaryl-coenzyme A reductase
Type:PROTEIN
Mol. Mass.:114890.37
Organism:Schizosaccharomyces pombe
Description:ChEMBL_638412
Residue:1053
BDBM50240783
NameBDBM50240783
Synonyms:1,2,4-Trimethoxy-5-propenyl-benzene CHEMBL333306 trans-asarone
TypeSmall organic molecule
Emp. Form.C12H16O3
Mol. Mass.208.2536
SMILESCOc1cc(OC)c(\C=C\C)cc1OC