Reaction Details
TargetMembrane-bound transcription factor site-1 protease
LigandBDBM50378788
Substrate/Competitorn/a
Meas. Tech.ChEMBL_641529 (CHEMBL1175363)
Ki 125000±n/a nM
Citation Basak, AMitra, DDas, AKMohottalage, DBasak, A C(2)-Symmetric azobenzene-amino acid conjugates and their inhibition of Subtilisin Kexin Isozyme-1. Bioorg Med Chem Lett20:3977-81 (2010) 
 
Membrane-bound transcription factor site-1 protease
Name:Membrane-bound transcription factor site-1 protease
Type:PROTEIN
Mol. Mass.:117773.36
Organism:Homo sapiens (Human)
Description:ChEMBL_641529
Residue:1052
BDBM50378788
NameBDBM50378788
Synonyms:CHEMBL1170116
TypeSmall organic molecule
Emp. Form.C40H44N4O8
Mol. Mass.708.7994
SMILESCC(C)[C@H](NC(=O)COc1ccccc1\N=N\c1ccccc1OCC(=O)N[C@@H](C(C)C)C(=O)OCc1ccccc1)C(=O)OCc1ccccc1