Reaction Details
TargetMacrophage colony-stimulating factor 1 receptor
LigandBDBM50321367
Substrate/Competitorn/a
Meas. Tech.ChEMBL_640283 (CHEMBL1174608)
IC50 0.5±n/a nM
Citation Wilson, KJIllig, CRChen, JWall, MJBallentine, SKDesJarlais, RLChen, YSchubert, CDonatelli, RPetrounia, ICrysler, CSMolloy, CJChaikin, MAManthey, CLPlayer, MRTomczuk, BEMeegalla, SK Reducing ion channel activity in a series of 4-heterocyclic arylamide FMS inhibitors. Bioorg Med Chem Lett20:3925-9 (2010) 
 
Macrophage colony-stimulating factor 1 receptor
Name:Macrophage colony-stimulating factor 1 receptor
Type:Protein
Mol. Mass.:107979.48
Organism:Homo sapiens (Human)
Description:P07333
Residue:972
BDBM50321367
NameBDBM50321367
Synonyms:4-cyano-N-(2-cyclohexenyl-4-(1,3-dimethyl-2-oxohexahydropyrimidin-5-yl)phenyl)-1H-imidazole-2-carboxamide | CHEMBL1170786
TypeSmall organic molecule
Emp. Form.C23H26N6O2
Mol. Mass.418.4915
SMILESCN1CC(CN(C)C1=O)c1ccc(NC(=O)c2ncc([nH]2)C#N)c(c1)C1=CCCCC1