Reaction Details
Target3-phosphoinositide-dependent protein kinase 1
LigandBDBM50321378
Substrate/Competitorn/a
Meas. Tech.ChEMBL_640311 (CHEMBL1174636)
EC50 53000±n/a nM
Citation Wei, LGao, XWarne, RHao, XBussiere, DGu, XJUno, TLiu, Y Design and synthesis of benzoazepin-2-one analogs as allosteric binders targeting the PIF pocket of PDK1. Bioorg Med Chem Lett20:3897-902 (2010) 
 
3-phosphoinositide-dependent protein kinase 1
Name:3-phosphoinositide-dependent protein kinase 1
Type:Enzyme
Mol. Mass.:63157.65
Organism:Homo sapiens (Human)
Description:O15530
Residue:556
BDBM50321378
NameBDBM50321378
Synonyms:2-(3-(4-methoxyphenylthio)-2-oxo-2,3,4,5-tetrahydro-1H-benzo[b]azepin-1-yl)acetic acid | CHEMBL1171125
TypeSmall organic molecule
Emp. Form.C19H19NO4S
Mol. Mass.357.423
SMILESCOc1ccc(SC2CCc3ccccc3N(CC(O)=O)C2=O)cc1