Reaction Details
TargetCyclin-dependent kinase 6/G1/S-specific cyclin-D1
LigandBDBM50321451
Substrate/Competitorn/a
Meas. Tech.ChEMBL_640754 (CHEMBL1175695)
IC50 51300±n/a nM
Citation Caridha, DKathcart, AKJirage, DWaters, NC Activity of substituted thiophene sulfonamides against malarial and mammalian cyclin dependent protein kinases. Bioorg Med Chem Lett20:3863-7 (2010) 
 
Cyclin-dependent kinase 6/G1/S-specific cyclin-D1
Name:Cyclin-dependent kinase 6/G1/S-specific cyclin-D1
Type:n/a
Mol. Mass.:n/a
Description:ASSAY_ID of ChEMBL is 1935149
Components:This complex has 2 components.
Component 1
Name:G1/S-specific cyclin-D1
Synonyms:B-cell lymphoma 1 protein BCL-1 oncogene CCND1 PRAD1 | PRAD1 oncogene
Type:Enzyme Subunit
Mol. Mass.:33717.70
Organism:Homo sapiens (Human)
Description:n/a
Residue:295
Component 2
Name:Cyclin-dependent kinase 6
Synonyms:CDK6 CDKN6 Cyclin-dependent kinase 6 (CDK 6) | Serine/threonine-protein kinase PLSTIRE
Type:Enzyme Subunit
Mol. Mass.:36937.42
Organism:Homo sapiens (Human)
Description:Q00534
Residue:326
BDBM50321451
NameBDBM50321451
Synonyms:2,5-dichloro-N-p-tolylthiophene-3-sulfonamide | CHEMBL1171972
TypeSmall organic molecule
Emp. Form.C11H9Cl2NO2S2
Mol. Mass.322.231
SMILESCc1ccc(NS(=O)(=O)c2cc(Cl)sc2Cl)cc1