Reaction Details
TargetHistamine H3 receptor
LigandBDBM50321469
Substrate/Competitorn/a
Meas. Tech.ChEMBL_640775 (CHEMBL1175767)
Ki 4.6±n/a nM
Citation Letavic, MAAluisio, LAtack, JRBonaventure, PCarruthers, NIDugovic, CEverson, AFeinstein, MAFraser, ICHoey, KJiang, XKeith, JMKoudriakova, TLeung, PLord, BLovenberg, TWLy, KSMorton, KLMotley, STNepomuceno, DRizzolio, MRynberg, RSepassi, KShelton, J Pre-clinical characterization of aryloxypyridine amides as histamine H3 receptor antagonists: identification of candidates for clinical development. Bioorg Med Chem Lett20:4210-4 (2010) 
 
Histamine H3 receptor
Name:Histamine H3 receptor
Type:G Protein-Coupled Receptor (GPCR)
Mol. Mass.:48691.47
Organism:Homo sapiens (Human)
Description:Binding assays were using CHO cells stably expressing hH3R receptors.
Residue:445
BDBM50321469
NameBDBM50321469
Synonyms:(4-cyclobutyl-1,4-diazepan-1-yl)(5-(4-fluorophenylthio)pyridin-2-yl)methanone | CHEMBL1171342
TypeSmall organic molecule
Emp. Form.C21H24FN3OS
Mol. Mass.385.498
SMILESFc1ccc(Sc2ccc(nc2)C(=O)N2CCCN(CC2)C2CCC2)cc1