Reaction Details
TargetHistamine H3 receptor
LigandBDBM50321465
Substrate/Competitorn/a
Meas. Tech.ChEMBL_640783 (CHEMBL1175775)
Ki 15±n/a nM
Citation Letavic, MAAluisio, LAtack, JRBonaventure, PCarruthers, NIDugovic, CEverson, AFeinstein, MAFraser, ICHoey, KJiang, XKeith, JMKoudriakova, TLeung, PLord, BLovenberg, TWLy, KSMorton, KLMotley, STNepomuceno, DRizzolio, MRynberg, RSepassi, KShelton, J Pre-clinical characterization of aryloxypyridine amides as histamine H3 receptor antagonists: identification of candidates for clinical development. Bioorg Med Chem Lett20:4210-4 (2010) 
 
Histamine H3 receptor
Name:Histamine H3 receptor
Type:G Protein-Coupled Receptor (GPCR)
Mol. Mass.:48607.98
Organism:Rattus norvegicus (rat)
Description:n/a
Residue:445
BDBM50321465
NameBDBM50321465
Synonyms:(6-(3-chlorophenoxy)pyridin-3-yl)(4-cyclobutyl-1,4-diazepan-1-yl)methanone | CHEMBL1171002
TypeSmall organic molecule
Emp. Form.C21H24ClN3O2
Mol. Mass.385.887
SMILESClc1cccc(Oc2ccc(cn2)C(=O)N2CCCN(CC2)C2CCC2)c1