Reaction Details
TargetHistamine H3 receptor
LigandBDBM50321466
Substrate/Competitorn/a
Meas. Tech.ChEMBL_640783 (CHEMBL1175775)
Ki 11±n/a nM
Citation Letavic, MAAluisio, LAtack, JRBonaventure, PCarruthers, NIDugovic, CEverson, AFeinstein, MAFraser, ICHoey, KJiang, XKeith, JMKoudriakova, TLeung, PLord, BLovenberg, TWLy, KSMorton, KLMotley, STNepomuceno, DRizzolio, MRynberg, RSepassi, KShelton, J Pre-clinical characterization of aryloxypyridine amides as histamine H3 receptor antagonists: identification of candidates for clinical development. Bioorg Med Chem Lett20:4210-4 (2010) 
 
Histamine H3 receptor
Name:Histamine H3 receptor
Type:G Protein-Coupled Receptor (GPCR)
Mol. Mass.:48607.98
Organism:Rattus norvegicus (rat)
Description:n/a
Residue:445
BDBM50321466
NameBDBM50321466
Synonyms:3-(5-(4-cyclobutyl-1,4-diazepane-1-carbonyl)pyridin-2-yloxy)benzonitrile | CHEMBL1171756
TypeSmall organic molecule
Emp. Form.C22H24N4O2
Mol. Mass.376.4516
SMILESO=C(N1CCCN(CC1)C1CCC1)c1ccc(Oc2cccc(c2)C#N)nc1