Reaction Details
TargetOrexin/Hypocretin receptor type 1
LigandBDBM50321511
Substrate/Competitorn/a
Meas. Tech.ChEMBL_639601 (CHEMBL1175134)
Ki 0.9±n/a nM
Citation Coleman, PJSchreier, JDRoecker, AJMercer, SPMcGaughey, GBCox, CDHartman, GDHarrell, CMReiss, DRDoran, SMGarson, SLAnderson, WBTang, CPrueksaritanont, TWinrow, CJRenger, JJ Discovery of 3,9-diazabicyclo[4.2.1]nonanes as potent dual orexin receptor antagonists with sleep-promoting activity in the rat. Bioorg Med Chem Lett20:4201-5 (2010) 
 
Orexin/Hypocretin receptor type 1
Name:Orexin/Hypocretin receptor type 1
Type:Protein
Mol. Mass.:47554.50
Organism:Homo sapiens (Human)
Description:O43613
Residue:425
BDBM50321511
NameBDBM50321511
Synonyms:(+/-)-(9-(7-fluoroquinazolin-2-yl)-3,9-diazabicyclo[4.2.1]nonan-3-yl)(5-methyl-2-(2H-1,2,3-triazol-2-yl)phenyl)methanone | CHEMBL1170803
TypeSmall organic molecule
Emp. Form.C25H24FN7O
Mol. Mass.457.5028
SMILESCc1ccc(c(c1)C(=O)N1CCC2CCC(C1)N2c1ncc2ccc(F)cc2n1)-n1nccn1