Reaction Details
TargetAdenosine receptor A2b
LigandBDBM50321519
Substrate/Competitorn/a
Meas. Tech.ChEMBL_639627 (CHEMBL1175305)
IC50 7±n/a nM
Citation Cheung, AWBrinkman, JFirooznia, FFlohr, AGrimsby, JGubler, MLGuertin, KHamid, RMarcopulos, NNorcross, RDQi, LRamsey, GTan, JWen, YSarabu, R 4-Substituted-7-N-alkyl-N-acetyl 2-aminobenzothiazole amides: drug-like and non-xanthine based A2B adenosine receptor antagonists. Bioorg Med Chem Lett20:4140-6 (2010) 
 
Adenosine receptor A2b
Name:Adenosine receptor A2b
Type:G Protein-Coupled Receptor (GPCR)
Mol. Mass.:36341.22
Organism:Homo sapiens (Human)
Description:n/a
Residue:332
BDBM50321519
NameBDBM50321519
Synonyms:CHEMBL1170519 | N-(7-(N-ethylacetamido)-4-methoxybenzo[d]thiazol-2-yl)-1H-pyrrole-3-carboxamide
TypeSmall organic molecule
Emp. Form.C17H18N4O3S
Mol. Mass.358.415
SMILESCCN(C(C)=O)c1ccc(OC)c2nc(NC(=O)c3cc[nH]c3)sc12