Reaction Details
TargetAdenosine receptor A2b
LigandBDBM50321545
Substrate/Competitorn/a
Meas. Tech.ChEMBL_639630 (CHEMBL1175308)
Ki 8±n/a nM
Citation Cheung, AWBrinkman, JFirooznia, FFlohr, AGrimsby, JGubler, MLGuertin, KHamid, RMarcopulos, NNorcross, RDQi, LRamsey, GTan, JWen, YSarabu, R 4-Substituted-7-N-alkyl-N-acetyl 2-aminobenzothiazole amides: drug-like and non-xanthine based A2B adenosine receptor antagonists. Bioorg Med Chem Lett20:4140-6 (2010) 
 
Adenosine receptor A2b
Name:Adenosine receptor A2b
Type:G Protein-Coupled Receptor (GPCR)
Mol. Mass.:36341.22
Organism:Homo sapiens (Human)
Description:n/a
Residue:332
BDBM50321545
NameBDBM50321545
Synonyms:CHEMBL1172275 | N-(7-(N-ethylacetamido)-4-methoxybenzo[d]thiazol-2-yl)-4-(1H-imidazol-1-yl)benzamide
TypeSmall organic molecule
Emp. Form.C22H21N5O3S
Mol. Mass.435.499
SMILESCCN(C(C)=O)c1ccc(OC)c2nc(NC(=O)c3ccc(cc3)-n3ccnc3)sc12