Reaction Details
TargetCyclin-dependent kinase 2
LigandBDBM50321579
Substrate/Competitorn/a
Meas. Tech.ChEMBL_639725 (CHEMBL1175614)
IC50 12±n/a nM
Citation Angiolini, MBanfi, PCasale, ECasuscelli, FFiorelli, CSaccardo, MBSilvagni, MZuccotto, F Structure-based optimization of potent PDK1 inhibitors. Bioorg Med Chem Lett20:4095-9 (2010) 
 
Cyclin-dependent kinase 2
Name:Cyclin-dependent kinase 2
Type:Enzyme Subunit
Mol. Mass.:33938.17
Organism:Homo sapiens (Human)
Description:P24941
Residue:298
BDBM50321579
NameBDBM50321579
Synonyms:8-(phenylamino)-1-(piperidin-4-ylmethyl)-4,5-dihydro-1H-pyrazolo[4,3-h]quinazoline-3-carboxamide | CHEMBL1171949
TypeSmall organic molecule
Emp. Form.C22H25N7O
Mol. Mass.403.4802
SMILESNC(=O)c1nn(CC2CCNCC2)c-2c1CCc1cnc(Nc3ccccc3)nc-21