Reaction Details
TargetP2Y purinoceptor 1
LigandBDBM50321588
Substrate/Competitorn/a
Meas. Tech.ChEMBL_639731 (CHEMBL1175620)
Ki 760±n/a nM
Citation Thalji, RKAiyar, NDavenport, EAErhardt, JAKallal, LAMorrow, DMSenadhi, SBurns-Kurtis, CLMarino, JP Benzofuran-substituted urea derivatives as novel P2Y(1) receptor antagonists. Bioorg Med Chem Lett20:4104-7 (2010) 
 
P2Y purinoceptor 1
Name:P2Y purinoceptor 1
Type:Enzyme
Mol. Mass.:42090.25
Organism:Homo sapiens (Human)
Description:P47900
Residue:373
BDBM50321588
NameBDBM50321588
Synonyms:1-(4-chlorophenyl)-3-(2-(2-isopropylphenyl)benzofuran-7-yl)urea | CHEMBL1170328
TypeSmall organic molecule
Emp. Form.C24H21ClN2O2
Mol. Mass.404.889
SMILESCC(C)c1ccccc1-c1cc2cccc(NC(=O)Nc3ccc(Cl)cc3)c2o1