Reaction Details
TargetMu-type opioid receptor
LigandBDBM21123
Substrate/Competitorn/a
Meas. Tech.ChEMBL_639787 (CHEMBL1175732)
Ki 2.8±n/a nM
Citation Lee, YSFernandes, SKulkarani, VMayorov, ADavis, PMa, SWBrown, KGillies, RJLai, JPorreca, FHruby, VJ Design and synthesis of trivalent ligands targeting opioid, cholecystokinin, and melanocortin receptors for the treatment of pain. Bioorg Med Chem Lett20:4080-4 (2010) 
 
Mu-type opioid receptor
Name:Mu-type opioid receptor
Type:G Protein-Coupled Receptor (GPCR)
Mol. Mass.:44503.11
Organism:Rattus norvegicus (rat)
Description:Competition binding assays were carried out using membrane preparations from transfected HN9.10 cells that constitutively expressed the mu opioid receptor.
Residue:398
BDBM21123
NameBDBM21123
Synonyms:(2S)-2-{2-[(2R)-2-[(2S)-2-amino-3-(4-hydroxyphenyl)propanamido]propanamido]acetamido}-3-phenylpropanamide YDAGF-NH2
TypePeptide
Emp. Form.C23H29N5O5
Mol. Mass.455.5069
SMILESC[C@@H](NC(=O)[C@@H](N)Cc1ccc(O)cc1)C(=O)NCC(=O)N[C@@H](Cc1ccccc1)C(N)=O