Reaction Details
TargetMethionine aminopeptidase 2
LigandBDBM32203
Substrate/Competitorn/a
Meas. Tech.ChEMBL_639878 (CHEMBL1173893)
IC50 5600±n/a nM
Citation Altmeyer, MAMarschner, ASchiffmann, RKlein, CD Subtype-selectivity of metal-dependent methionine aminopeptidase inhibitors. Bioorg Med Chem Lett20:4038-44 (2010) 
 
Methionine aminopeptidase 2
Name:Methionine aminopeptidase 2
Type:Enzyme
Mol. Mass.:52884.45
Organism:Homo sapiens (Human)
Description:P50579
Residue:478
BDBM32203
NameBDBM32203
Synonyms:8-quinolinol US10005735, Table 1.7 cid_1923 quinolin-8-ol
TypeSmall organic molecule
Emp. Form.C9H7NO
Mol. Mass.145.158
SMILESOc1cccc2cccnc12